{"text_format":"1","workbook":"xlsx","n_sheets":17,"sheets":["Cost Report Posting & Training","Cost Report Build Update","2023 Notes","Lists","Administrator Regression Table","ISS Detail","RES","Checklist","ReadMe","A - General Info & Cert","B - ISS Payroll Expenses","C - Non-ISS Expenses","D - Revenue","E - Residential Staffing","E - Residential Staffing Add'l","F - Healthcare Expenses","G - ISS Settlement"],"not_rendered":{"charts":0,"images":4,"macros":1,"external_links":12,"defined_names":6789,"comments":8,"pivot_tables":0},"unopened":[],"bounds":{"document_bytes":16777216,"sheet_cells":100000,"rows_first":2000,"rows_last":500,"rows_between":2000,"halvings":0,"cell_chars":16384,"cell_head_chars":4096},"cells_cut":0,"cells_raw":0,"read":"whole","date_system":"1900"}

{"sheet":"Cost Report Posting & Training","index":0,"n_rows":20,"n_cols":1,"rows_kept":20,"cut":false,"hidden":true,"merged":[]}
["INCOMPLETE"]
["Cost Report training is completed between October and November each year so that providers are prepared to complete their cost report as soon as the year ends. The current year cost report template was made available to the providers at the beginning of the calendar year. Providers will need to be notified of any major template changes that would require them to transfer their data to a revised template. Providers will also be notified of any known changes (if any) to the upcoming calendar year template that will be posted in January. "]
[]
["All the following resources will need to be revised for any changes made to the reporting & training process. Each resource has instructions located within the file. "]
[]
["YYYY ABC Sample - Cost Report"]
["YYYY ABC Sample - Schedule H Rate History"]
["YYYY ABC Sample - Scheduel I Allocations"]
{"$rows_left_out":13}
{"sheet":"Cost Report Build Update","index":1,"n_rows":56,"n_cols":1,"rows_kept":56,"cut":false,"hidden":true,"merged":[]}
["INCOMPLETE"]
[]
["Workbook must be manipulated to accommodate DDA changes. Use the sample cost report to make changes so that the "]
[]
["Unhide all tabs"]
[]
[]
[]
{"$rows_left_out":49}
{"sheet":"2023 Notes","index":2,"n_rows":23,"n_cols":1,"rows_kept":23,"cut":false,"hidden":true,"merged":[]}
["2022 Cost Report Template changes"]
["Regression table increased 23%"]
["Regression table changed back to 21 FTE's (SL & Combined agencies with fewer than 21 FTE's calculated on Schedule B are eligible to claim ISS, providing ISS duties are performed)"]
["Replaced Schedule E, reformated visually, added box for #3"]
["Corrected Sch F missing provider name"]
["Corrected spelling \"regular\" on Sch B, columns D/G"]
["Updated list tab - provider names, ID, & urban designation for drop down lists"]
["Revised ARC of Clark name to be Arc of Southwest Washington"]
{"$rows_left_out":16}
{"sheet":"Lists","index":3,"n_rows":143,"n_cols":15,"rows_kept":143,"cut":false,"hidden":true,"merged":[[0,6,0,9]]}
["Provider Name","Provider ID","Urban Designation",null,"Schedule B Monthly / Quarterly",null,"Schedule B",null,null,null,null,"Program Type",null,"B&O CITY","effective 1/1/22"]
[null,null,null,null,null,null,1,"2a","2b","2c"]
["1N - Accendo of Washington",215573301,"MSA",null,"Monthly",null,null,null,null,null,null,"SL Supported Living",null,"Aberdeen"]
["1N - Adult Guidance & Empowerment Service",111684901,"MSA",null,"Quarterly",null,"Yes","Yes","Yes","Program Revenues",null,"GH Group Home",null,"Algona"]
["1N - Alpha Supported Living (Spokane)",111320906,"MSA",null,null,null,"No","No","No","ISS/Direct Care Cost",null,"GTH Group Training Home",null,"Auburn"]
["1N - Ambitions Accendo",111901911,"MSA",null,null,null,null,null,null,"Other Method - Please describe",null,null,null,"Bainbridge Island"]
["1N - Ambitions - Moses Lake, Omak, and Wenatchee",111901903,"MSA/NON-MSA",null,null,null,null,null,null,null,null,null,null,"Bellevue"]
["1N - Ambitions - Spokane",111901906,"MSA",null,null,null,null,null,null,null,null,null,null,"Bellingham"]
{"$rows_left_out":136}
{"sheet":"Administrator Regression Table","index":4,"n_rows":59,"n_cols":21,"rows_kept":59,"cut":false,"hidden":true,"merged":[[0,6,1,6]]}
["NUMBER OF ISS FTE's","KING","MSA","MSA/\nNON-MSA","NON-MSA",null,"Annual ISS Wages used to calculate FTE's","KING","MSA","MSA/\nNON-MSA","NON-MSA",null,"URBAN DESIGNATION & REPORTING PERIOD","FTE MTH/QRT WAGES FOR FY",null,{"$f":"CONCATENATE(Q1,'B - ISS Payroll Expenses'!B10)","v":{"$error":"#N/A"}},{"$f":"VLOOKUP(_M000001,Lists!A1:C144,3)","v":{"$error":"#N/A"}},"KING","MSA","MSA/\nNON-MSA","NON-MSA"]
[1,{"$f":"ROUND((117772.66*1.02),2)","v":120128.11},{"$f":"ROUND((114154.46*1.02),2)","v":116437.55},{"$f":"ROUND((113219.74*1.02),2)","v":115484.13},{"$f":"ROUND((112285.04*1.02),2)","v":114530.74},null,null,{"$f":"B2/2","v":60064.055},{"$f":"C2/2","v":58218.775000000001},{"$f":"D2/2","v":57742.065000000002},{"$f":"E2/2","v":57265.37},null,"KingMonthly",{"$f":"H2/12","v":5005.3379166666664}]
[2,{"$f":"$B$2-($B$2*(A3-1)*5%)","v":114121.70449999999},{"$f":"$C$2-($C$2*(A3-1)*5%)","v":110615.6725},{"$f":"$D$2-($D$2*(A3-1)*5%)","v":109709.9235},{"$f":"$E$2-($E$2*(A3-1)*5%)","v":108804.20300000001},null,null,null,null,null,null,null,"KingQuarterly",{"$f":"H2/4","v":15016.01375}]
[3,108115.299,104793.795,103935.717,103077.666,null,null,null,null,null,null,null,"MSA/NON-MSAMonthly",{"$f":"J2/12","v":4811.8387499999999}]
[4,102108.89350000001,98971.917499999996,98161.510500000004,97351.129000000001,null,null,null,null,null,null,null,"MSA/NON-MSAQuarterly",{"$f":"J2/4","v":14435.516250000001}]
[5,96102.487999999998,93150.040000000008,92387.304000000004,91624.592000000004,null,null,null,null,null,null,null,"MSAMonthly",{"$f":"I2/12","v":4851.5645833333338}]
[6,90096.08249999999,87328.162500000006,86613.097500000003,85898.054999999993,null,null,null,null,null,null,null,"MSAQuarterly",{"$f":"I2/4","v":14554.69375}]
[7,84089.676999999996,81506.285000000003,80838.891000000003,80171.518000000011,null,null,null,null,null,null,null,"NON-MSAMonthly",{"$f":"K2/12","v":4772.1141666666672}]
{"$rows_left_out":52}
{"sheet":"ISS Detail","index":5,"n_rows":11,"n_cols":11,"rows_kept":11,"cut":false,"hidden":true,"merged":[[0,9,1,9],[0,10,1,10],[8,0,8,1],[0,1,0,2],[0,3,0,7],[0,0,1,0],[0,8,1,8]]}
["SCHEDULE B LINE/ROW","Working ISS Expenses",null,"Non-working ISS Expenses",null,null,null,null,"TOTALS","SCHEDULE B, COLUMN S","VARIANCE"]
[null,"REG WAGES","2/3 OT WAGES","1/3 OT WAGES","PTO WAGES","OTHER WAGES","ER PAID TAXES","ER PAID BENEFITS"]
["LINE 1",{"$f":"'B - ISS Payroll Expenses'!E73","v":0},{"$f":"'B - ISS Payroll Expenses'!F73/3*2","v":0},{"$f":"'B - ISS Payroll Expenses'!F73/3","v":0},{"$f":"'B - ISS Payroll Expenses'!M73","v":0},{"$f":"'B - ISS Payroll Expenses'!N73","v":0},{"$f":"'B - ISS Payroll Expenses'!P73","v":0},{"$f":"'B - ISS Payroll Expenses'!Q73","v":0},{"$f":"SUM(B3:H3)","v":0},{"$f":"'B - ISS Payroll Expenses'!S73","v":0},{"$f":"J3-I3","v":0}]
["LINE 2",{"$f":"'B - ISS Payroll Expenses'!E74","v":0},{"$f":"'B - ISS Payroll Expenses'!F74/3*2","v":0},{"$f":"'B - ISS Payroll Expenses'!F74/3","v":0},{"$f":"'B - ISS Payroll Expenses'!M74*'B - ISS Payroll Expenses'!G74","v":0},{"$f":"'B - ISS Payroll Expenses'!N74*'B - ISS Payroll Expenses'!G74","v":0},{"$f":"'B - ISS Payroll Expenses'!P74*'B - ISS Payroll Expenses'!G74","v":0},{"$f":"'B - ISS Payroll Expenses'!Q74*'B - ISS Payroll Expenses'!G74","v":0},{"$f":"SUM(B4:H4)","v":0},{"$f":"'B - ISS Payroll Expenses'!S74","v":0},{"$f":"J4-I4","v":0}]
["LINE 3",{"$f":"'B - ISS Payroll Expenses'!E75","v":0},{"$f":"'B - ISS Payroll Expenses'!F75/3*2","v":0},{"$f":"'B - ISS Payroll Expenses'!F75/3","v":0},{"$f":"'B - ISS Payroll Expenses'!M75*'B - ISS Payroll Expenses'!G75","v":0},{"$f":"'B - ISS Payroll Expenses'!N75*'B - ISS Payroll Expenses'!G75","v":0},{"$f":"'B - ISS Payroll Expenses'!P75*'B - ISS Payroll Expenses'!G75","v":0},{"$f":"'B - ISS Payroll Expenses'!Q75*'B - ISS Payroll Expenses'!G75","v":0},0,{"$f":"'B - ISS Payroll Expenses'!S75","v":0},{"$f":"J5-I5","v":0}]
["LINE 4",{"$f":"('B - ISS Payroll Expenses'!S76*('B - ISS Payroll Expenses'!E76/('B - ISS Payroll Expenses'!E76+'B - ISS Payroll Expenses'!F76+'B - ISS Payroll Expenses'!M76+'B - ISS Payroll Expenses'!N76+'B - ISS Payroll Expenses'!P76+'B - ISS Payroll Expenses'!Q76)))","v":{"$error":"#DIV/0!"}},{"$f":"('B - ISS Payroll Expenses'!S76*('B - ISS Payroll Expenses'!F76/('B - ISS Payroll Expenses'!E76+'B - ISS Payroll Expenses'!F76+'B - ISS Payroll Expenses'!M76+'B - ISS Payroll Expenses'!N76+'B - ISS Payroll Expenses'!P76+'B - ISS Payroll Expenses'!Q76))/3)*2","v":{"$error":"#DIV/0!"}},{"$f":"('B - ISS Payroll Expenses'!S76*('B - ISS Payroll Expenses'!F76/('B - ISS Payroll Expenses'!E76+'B - ISS Payroll Expenses'!F76+'B - ISS Payroll Expenses'!M76+'B - ISS Payroll Expenses'!N76+'B - ISS Payroll Expenses'!P76+'B - ISS Payroll Expenses'!Q76)))/3","v":{"$error":"#DIV/0!"}},{"$f":"'B - ISS Payroll Expenses'!S76*('B - ISS Payroll Expenses'!M76/('B - ISS Payroll Expenses'!E76+'B - ISS Payroll Expenses'!F76+'B - ISS Payroll Expenses'!M76+'B - ISS Payroll Expenses'!N76+'B - ISS Payroll Expenses'!P76+'B - ISS Payroll Expenses'!Q76))","v":{"$error":"#DIV/0!"}},{"$f":"'B - ISS Payroll Expenses'!S76*('B - ISS Payroll Expenses'!N76/('B - ISS Payroll Expenses'!E76+'B - ISS Payroll Expenses'!F76+'B - ISS Payroll Expenses'!M76+'B - ISS Payroll Expenses'!N76+'B - ISS Payroll Expenses'!P76+'B - ISS Payroll Expenses'!Q76))","v":{"$error":"#DIV/0!"}},{"$f":"'B - ISS Payroll Expenses'!S76*('B - ISS Payroll Expenses'!P76/('B - ISS Payroll Expenses'!E76+'B - ISS Payroll Expenses'!F76+'B - ISS Payroll Expenses'!M76+'B - ISS Payroll Expenses'!N76+'B - ISS Payroll Expenses'!P76+'B - ISS Payroll Expenses'!Q76))","v":{"$error":"#DIV/0!"}},{"$f":"'B - ISS Payroll Expenses'!S76*('B - ISS Payroll Expenses'!Q76/('B - ISS Payroll Expenses'!E76+'B - ISS Payroll Expenses'!F76+'B - ISS Payroll Expenses'!M76+'B - ISS Payroll Expenses'!N76+'B - ISS Payroll Expenses'!P76+'B - ISS Payroll Expenses'!Q76))","v":{"$error":"#DIV/0!"}},{"$error":"#DIV/0!"},{"$f":"'B - ISS Payroll Expenses'!S76","v":0},{"$f":"J6-I6","v":{"$error":"#DIV/0!"}}]
["TOTALS",{"$f":"SUM(B3:B6)","v":{"$error":"#DIV/0!"}},{"$f":"SUM(C3:C6)","v":{"$error":"#DIV/0!"}},{"$error":"#DIV/0!"},{"$error":"#DIV/0!"},{"$error":"#DIV/0!"},{"$error":"#DIV/0!"},{"$error":"#DIV/0!"},{"$f":"SUM(I3:I6)","v":{"$error":"#DIV/0!"}},{"$f":"SUM(J3:J6)","v":0},{"$f":"SUM(K3:K6)","v":{"$error":"#DIV/0!"}}]
[null,null,null,null,null,null,null,null,{"$f":"I7-SUM(B7:H7)","v":{"$error":"#DIV/0!"}}]
{"$rows_left_out":4}
{"sheet":"RES","index":6,"n_rows":75,"n_cols":38,"rows_kept":75,"cut":false,"hidden":true,"merged":[[17,0,17,1],[0,0,15,0],[0,5,15,7]]}
[" ","REGION:",{"$f":"LEFT(_M001742,2)","v":"0"},{"$f":"LEFT(_M001742,2)","v":"0"},{"$f":"LEFT(_M001742,2)","v":"0"}]
[null,"FILE:",{"$f":"MID(CELL(\"filename\",A1),FIND(\"[\",CELL(\"filename\",A1))+1,FIND(\".\",CELL(\"filename\",A1),FIND(\"[\",CELL(\"filename\",A1))+1)-FIND(\"[\",CELL(\"filename\",A1))-1)","v":"2023 Cost Report - Template"},{"$f":"MID(CELL(\"filename\",B2),FIND(\"[\",CELL(\"filename\",B2))+1,FIND(\".\",CELL(\"filename\",B2),FIND(\"[\",CELL(\"filename\",B2))+1)-FIND(\"[\",CELL(\"filename\",B2))-1)","v":"2023 Cost Report - Template"},{"$f":"MID(CELL(\"filename\",C2),FIND(\"[\",CELL(\"filename\",C2))+1,FIND(\".\",CELL(\"filename\",C2),FIND(\"[\",CELL(\"filename\",C2))+1)-FIND(\"[\",CELL(\"filename\",C2))-1)","v":"2023 Cost Report - Template"}]
[null,"PROVIDER ID:",{"$f":"_C000002","v":""},{"$f":"_C000002","v":""},{"$f":"_C000002","v":""}]
[null,"PROVIDER REGION & NAME:",{"$f":"_M000001","v":0},{"$f":"_M000001","v":0},{"$f":"_M000001","v":0}]
[null,"PROVIDER MAILING ADDRESS:",{"$f":"_M000004","v":0},{"$f":"_M000004","v":0},{"$f":"_M000004","v":0}]
[null,"CITY, STATE, ZIP:",{"$f":"_M000005","v":0},{"$f":"_M000005","v":0},{"$f":"_M000005","v":0}]
[null,"HOME OFFICE MAILING ADDRESS:",{"$f":"IF(_M000011=\"\",\"\",_M000011)","v":""},{"$f":"IF(_M000011=\"\",\"\",_M000011)","v":""},{"$f":"IF(_M000011=\"\",\"\",_M000011)","v":""}]
[null,"HOME OFFICE CITY, STATE, ZIP:",{"$f":"IF(_M000012=\"\",\"\",_M000012)","v":""},{"$f":"IF(_M000012=\"\",\"\",_M000012)","v":""},{"$f":"IF(_M000012=\"\",\"\",_M000012)","v":""}]
{"$rows_left_out":68}
{"sheet":"Checklist","index":7,"n_rows":19,"n_cols":5,"rows_kept":19,"cut":false,"hidden":true,"merged":[[0,0,0,4],[2,1,2,3],[17,3,18,3],[17,4,18,4]]}
["RESIDENTIAL COST REPORT ANALYSIS CHECKLIST"]
[null,"Agency Region & Name:"]
[null,{"$f":"'A - General Info & Cert'!B6:C6","v":0}]
[]
[null,"Upon receiving a cost report the analyst does the following for each schedule: "]
[]
[null,"Analyst Initials","Date Analyzed","Schedule","To Be Reviewed/Analyzed"]
[null,null,null,"Schedule A ","Verify correct provider name is selected in box 1 drop down list\nBe sure there is contact information for questions\nCheck for dates in line 18\nSigned certification is received via scan, fax, or mail"]
{"$rows_left_out":12}
{"sheet":"ReadMe","index":8,"n_rows":36,"n_cols":4,"rows_kept":36,"cut":false,"hidden":false,"merged":[[0,0,0,4],[1,1,1,3],[2,1,2,3],[28,1,28,3],[29,2,29,3],[20,1,20,3],[22,1,22,3],[24,1,24,3],[26,1,26,3],[10,1,10,3],[12,1,12,3],[18,1,18,3],[5,1,5,3],[6,1,6,3],[8,1,8,3],[3,1,3,3],[14,1,14,3],[16,1,16,3],[30,1,30,3]]}
[]
[null,"DDA Residential Programs Cost Report General Guidelines"]
[]
[null,"1. For 2023, the Administrator Regression table maximums have been increased 2% relative to the increase in the daily rate and covid funds have been reduced from 7.3% to 5.4%, effective January 1, 2023. Four questions have been added to Schedule C and Schedule E has been revised to report staffing on a semiannual basis. The ISS payroll review is still being developed and will be presented once complete."]
[]
[null,"2. It is recommended that the cost report preparer refer to the cost reporting instructions, DDA policy 6.04, PowerPoint Presentation and template samples while completing their cost report. Select the link below for Covid reporting requirements."]
[null,"Covid Reporting Requirements"]
[]
{"$rows_left_out":29}
{"sheet":"A - General Info & Cert","index":9,"n_rows":35,"n_cols":4,"rows_kept":35,"cut":false,"hidden":false,"merged":[[28,2,28,3],[2,1,2,4],[27,1,27,3],[5,1,5,2],[24,1,24,3],[7,3,7,4],[9,3,9,4],[11,1,11,4],[13,3,13,4],[15,2,15,4],[19,3,19,4],[26,2,26,3],[4,1,4,2],[0,1,0,4],[5,3,5,4],[17,3,17,4],[25,2,25,3],[22,1,22,3]]}
[null,"SCHEDULE  A"]
[]
[]
[null,"PART A - PROVIDER IDENTIFYING INFORMATION"]
[null,"1. PROVIDER AGENCY NAME",null,"2. PROVIDER ONE ID"]
[null,null,null,{"$f":"IF(_M000001=\"\",\"\",VLOOKUP(_M000001,Lists!$A$4:$B$144,2,FALSE))","v":""}]
[null,"3. PROVIDER MAILING ADDRESS","4. CITY, STATE, ZIP ","5. PROVIDER PHONE NUMBER"]
[]
{"$rows_left_out":28}
{"sheet":"B - ISS Payroll Expenses","index":10,"n_rows":79,"n_cols":21,"rows_kept":79,"cut":false,"hidden":false,"merged":[[9,3,9,20],[0,1,0,20],[2,3,7,18],[2,19,2,20],[12,3,14,3],[17,3,19,3],[22,3,24,3],[27,3,29,3],[32,3,34,3],[37,3,39,3],[72,3,74,3],[67,3,69,3],[42,3,44,3],[47,3,49,3],[62,3,64,3],[57,3,59,3],[52,3,54,3]]}
[null,"SCHEDULE B"]
[]
[null,null,null,"MONTHLY OR QUARTERLY PAYROLL REPORTING",null,null,null,null,null,null,null,null,null,null,null,null,null,null,null,{"$f":"_M000001","v":0}]
[null,null,null,null,null,null,null,null,null,null,null,null,null,null,null,null,null,null,null,"PROVIDER NAME"]
[]
[]
[]
[]
{"$rows_left_out":72}
{"sheet":"C - Non-ISS Expenses","index":11,"n_rows":56,"n_cols":8,"rows_kept":56,"cut":false,"hidden":false,"merged":[[34,4,36,4],[0,1,0,8],[38,2,38,3],[30,3,30,7],[25,3,25,5],[27,3,27,5],[29,3,29,5],[34,1,36,3],[2,6,2,8],[31,2,31,7],[19,2,19,6],[34,7,34,8],[35,7,36,8],[35,6,36,6],[35,5,36,5],[14,2,14,3],[42,2,42,3],[37,1,37,3],[38,7,38,8],[40,7,40,8],[37,7,37,8],[40,2,40,3],[42,7,42,8],[39,2,39,8],[41,2,41,8],[53,1,53,3],[46,1,46,3],[44,2,44,3],[49,7,49,8],[47,2,47,3],[51,7,51,8],[53,7,53,8],[44,7,44,8],[46,7,46,8],[47,7,47,8],[49,2,49,3],[51,2,51,3],[43,2,43,8],[45,2,45,8],[48,2,48,8],[50,2,50,8],[52,2,52,8]]}
[null,"SCHEDULE C"]
[]
[null,null,null,null,null,null,{"$f":"_M000001","v":0}]
[null,null,null,null,null,null,"PROVIDER NAME"]
[]
[]
[]
[]
{"$rows_left_out":49}
{"sheet":"D - Revenue","index":12,"n_rows":16,"n_cols":8,"rows_kept":16,"cut":false,"hidden":false,"merged":[[13,1,13,3],[11,2,11,3],[12,2,12,7],[0,1,0,7],[7,2,7,3],[8,2,8,7],[9,2,9,3],[10,2,10,7],[5,4,6,4],[2,6,2,7],[1,2,1,3],[3,2,3,3],[5,1,6,3]]}
[null,"SCHEDULE D"]
[]
[null,null,null,null,null,null,{"$f":"_M000001","v":0}]
[null,null,null,null,null,null,"PROVIDER NAME"]
[]
[null,"RESIDENTIAL SERVICES REVENUE",null,null,"TOTALS","A","B","C"]
[null,null,null,null,null,{"$f":"'C - Non-ISS Expenses'!_M000101","v":0},{"$f":"'C - Non-ISS Expenses'!_M000102","v":0},{"$f":"'C - Non-ISS Expenses'!_M000105","v":0}]
[null,1,"REVENUE FOR SERVICES PROVIDED",null,{"$f":"SUM(F8:H8)","v":0}]
{"$rows_left_out":9}
{"sheet":"E - Residential Staffing","index":13,"n_rows":88,"n_cols":17,"rows_kept":88,"cut":false,"hidden":false,"merged":[[36,2,36,13],[37,2,37,13],[38,2,38,13],[33,2,33,13],[34,2,34,13],[35,2,35,13],[30,2,30,13],[38,14,38,15],[37,14,37,15],[36,14,36,15],[31,2,31,13],[32,2,32,13],[41,14,41,15],[40,14,40,15],[39,14,39,15],[25,14,25,15],[29,14,29,15],[32,14,32,15],[31,14,31,15],[30,14,30,15],[35,14,35,15],[34,14,34,15],[33,14,33,15],[86,1,86,16],[71,15,71,16],[71,2,71,8],[72,2,72,8],[73,2,73,8],[74,2,74,8],[75,2,75,8],[80,15,80,16],[79,13,79,14],[80,13,80,14],[81,13,81,14],[82,13,82,14],[83,13,83,14],[73,13,73,14],[72,15,72,16],[73,15,73,16],[74,15,74,16],[75,15,75,16],[76,15,76,16],[83,2,83,12],[78,1,78,16],[85,1,85,16],[74,9,74,10],[74,11,74,12],[74,13,74,14],[75,9,75,10],[75,11,75,12],[75,13,75,14],[72,9,72,10],[72,11,72,12],[72,13,72,14],[73,9,73,10],[73,11,73,12],[79,15,79,16],[83,15,83,16],[82,15,82,16],[81,15,81,16],[81,2,81,12],[82,2,82,12],[79,2,79,12],[80,2,80,12],[76,9,76,10],[76,11,76,12],[76,13,76,14],[76,2,76,8],[60,13,60,15],[61,6,61,7],[61,8,61,11],[61,13,61,15],[71,9,71,10],[71,11,71,12],[71,13,71,14],[52,2,52,10],[53,2,53,10],[54,2,54,10],[55,2,55,10],[60,1,61,2],[60,6,60,7],[60,8,60,11],[59,1,59,16],[70,1,70,16],[45,2,45,10],[46,2,46,10],[47,2,47,10],[48,2,48,10],[49,2,49,10],[51,2,51,10],[39,2,39,13],[40,2,40,13],[41,2,41,13],[25,2,25,11],[29,2,29,13],[21,2,21,4],[18,2,18,4],[19,2,19,4],[20,2,20,4],[18,6,18,13],[19,6,19,13],[20,6,20,13],[21,6,21,13],[13,2,13,4],[13,5,13,11],[13,12,13,13],[13,14,13,15],[14,2,14,4],[14,5,14,11],[14,12,14,13],[14,14,14,15],[0,1,0,16],[2,2,2,6],[2,15,2,16],[3,15,3,16],[5,0,5,16],[7,0,7,16]]}
[null,"SCHEDULE E"]
[]
[null,null,null,null,null,null,null,null,null,null,null,null,null,null,null,{"$f":"'A - General Info & Cert'!B6","v":0}]
[null,null,null,null,null,null,null,null,null,null,null,null,null,null,null,"PROVIDER NAME"]
[]
["IMPORTANT, PLEASE READ before completing schedule:\nCOMPLETE A SEPARATE SCHEDULE FOR EACH LOCATION BY: PROGRAM TYPE, CITY, AND COUNTY \nFOR ADDITIONAL COPIES OF SCHEDULE E CONTACT YOUR AGENCY'S RATE ANALYST \nReporting Periods: January 1, 2023 to June 30, 2023 & July 1, 2023 to December 31, 2023 (Semiannual Year, 12 months, 2023)                                                                                                                                                                                                                                                                                                                                                                                                                                                                                                                                                                                                                                                     "]
[]
["The schedule(s) will be reviewed by the rate analyst to ensure the Agency is reporting contracts, programs, and locations separately. \nAny cost reports found to be incomplete will be returned to the agency for correction."]
{"$rows_left_out":81}
{"sheet":"E - Residential Staffing Add'l","index":14,"n_rows":88,"n_cols":17,"rows_kept":88,"cut":false,"hidden":false,"merged":[[83,2,83,12],[83,13,83,14],[83,15,83,16],[85,1,85,16],[86,1,86,16],[81,2,81,12],[81,13,81,14],[81,15,81,16],[82,2,82,12],[82,13,82,14],[82,15,82,16],[79,2,79,12],[79,13,79,14],[79,15,79,16],[80,2,80,12],[80,13,80,14],[80,15,80,16],[76,2,76,8],[76,9,76,10],[76,11,76,12],[76,13,76,14],[76,15,76,16],[78,1,78,16],[74,2,74,8],[74,9,74,10],[74,11,74,12],[74,13,74,14],[74,15,74,16],[75,2,75,8],[75,9,75,10],[75,11,75,12],[75,13,75,14],[75,15,75,16],[72,2,72,8],[72,9,72,10],[72,11,72,12],[72,13,72,14],[72,15,72,16],[73,2,73,8],[73,9,73,10],[73,11,73,12],[73,13,73,14],[73,15,73,16],[61,8,61,11],[61,13,61,15],[70,1,70,16],[71,2,71,8],[71,9,71,10],[71,11,71,12],[71,13,71,14],[71,15,71,16],[52,2,52,10],[53,2,53,10],[54,2,54,10],[55,2,55,10],[59,1,59,16],[60,1,61,2],[60,6,60,7],[60,8,60,11],[60,13,60,15],[61,6,61,7],[45,2,45,10],[46,2,46,10],[47,2,47,10],[48,2,48,10],[49,2,49,10],[51,2,51,10],[39,2,39,13],[39,14,39,15],[40,2,40,13],[40,14,40,15],[41,2,41,13],[41,14,41,15],[36,2,36,13],[36,14,36,15],[37,2,37,13],[37,14,37,15],[38,2,38,13],[38,14,38,15],[33,2,33,13],[33,14,33,15],[34,2,34,13],[34,14,34,15],[35,2,35,13],[35,14,35,15],[30,2,30,13],[30,14,30,15],[31,2,31,13],[31,14,31,15],[32,2,32,13],[32,14,32,15],[21,2,21,4],[21,6,21,13],[25,2,25,11],[25,14,25,15],[29,2,29,13],[29,14,29,15],[18,2,18,4],[18,6,18,13],[19,2,19,4],[19,6,19,13],[20,2,20,4],[20,6,20,13],[13,2,13,4],[13,5,13,11],[13,12,13,13],[13,14,13,15],[14,2,14,4],[14,5,14,11],[14,12,14,13],[14,14,14,15],[0,1,0,16],[2,2,2,6],[2,15,2,16],[3,15,3,16],[5,0,5,16],[7,0,7,16]]}
[null,"SCHEDULE E"]
[]
[null,null,null,null,null,null,null,null,null,null,null,null,null,null,null,{"$f":"'A - General Info & Cert'!B6","v":0}]
[null,null,null,null,null,null,null,null,null,null,null,null,null,null,null,"PROVIDER NAME"]
[]
["IMPORTANT, PLEASE READ before completing schedule:\nCOMPLETE A SEPARATE SCHEDULE FOR EACH LOCATION BY: PROGRAM TYPE, CITY, AND COUNTY \nFOR ADDITIONAL COPIES OF SCHEDULE E CONTACT YOUR AGENCY'S RATE ANALYST \nReporting Periods: January 1, 2023 to June 30, 2023 & July 1, 2023 to December 31, 2023 (Semiannual Year, 12 months, 2023)                                                                                                                                                                                                                                                                                                                                                                                                                                                                                                                                                                                                                                                     "]
[]
["The schedule(s) will be reviewed by the rate analyst to ensure the Agency is reporting contracts, programs, and locations separately. \nAny cost reports found to be incomplete will be returned to the agency for correction."]
{"$rows_left_out":81}
{"sheet":"F - Healthcare Expenses","index":15,"n_rows":43,"n_cols":11,"rows_kept":43,"cut":false,"hidden":false,"merged":[[17,4,17,8],[18,4,18,8],[19,4,19,8],[41,1,41,8],[27,9,27,10],[28,9,28,10],[30,9,30,10],[31,9,31,10],[32,9,32,10],[28,1,28,8],[27,1,27,8],[40,1,40,10],[35,1,36,4],[38,1,39,4],[33,9,33,10],[20,4,20,8],[0,1,0,10],[24,9,24,10],[26,9,26,10],[25,9,25,10],[3,9,3,10],[24,1,24,8],[25,1,25,8],[26,1,26,8],[6,0,6,11],[9,1,9,2],[8,9,8,10],[9,4,9,8],[10,4,10,8],[11,4,11,8],[5,0,5,11],[2,9,2,10],[10,1,10,2],[11,1,11,2],[12,1,12,2],[13,1,13,2],[12,4,12,8],[13,4,13,8],[42,1,42,10],[29,9,29,10],[41,9,41,10],[29,1,29,8],[30,1,30,8],[31,1,31,8],[32,1,32,8],[33,1,33,8],[34,1,34,10],[37,1,37,10]]}
[null,"SCHEDULE F"]
[]
[null,null,null,null,null,null,null,null,null,{"$f":"'A - General Info & Cert'!B6","v":0}]
[null,null,null,null,null,null,null,null,null,"PROVIDER NAME"]
[]
["INCLUDE ALL PROGRAMS FOR THE AGENCY ON THIS SCHEDULE"]
["Reporting Period: Dececmber 1, 2023  to  December 31, 2023 (One Month)"]
[null,"PROVIDER INFORMATION:"]
{"$rows_left_out":36}
{"sheet":"G - ISS Settlement","index":16,"n_rows":40,"n_cols":6,"rows_kept":40,"cut":false,"hidden":false,"merged":[[0,0,0,2],[29,0,29,2],[6,0,6,2],[33,1,33,2],[21,0,21,2],[27,0,27,2]]}
["SCHEDULE G"]
[null," "]
[null,null,{"$f":"_M000001","v":0}]
[null,null,"PROVIDER NAME"]
[]
["A","B","C"]
["REIMBURSEMENT SUMMARY"]
["Line","Tiered ISS Reimbursements by Program Type","ISS Reimbursement"]
{"$rows_left_out":32}